BDBM233432 US9351965, 39::US9351965, 40
SMILES COC1(Cc2ccccc2F)CCCC(C1)NC(=O)c1ccc2[nH]nc(-c3ccnc(C)c3)c2c1
InChI Key
Data  2 IC50
  Tab Delimited (TSV)   2D SDfile   Computed 3D by Vconf -m prep SDfile
Find this compound or compounds like it in BindingDB:
Activity Spreadsheet -- Enzyme Inhibition Constant Data from BindingDB
Found 2 hits for monomerid = 233432
TargetMitogen-activated protein kinase 1(Mus musculus (Mouse))
Merck Sharp & Dohme
US Patent
LigandPNGBDBM233432(US9351965, 39 | US9351965, 40)
Affinity DataIC50:  205nM. Assay description: Activated ERK2 activity was also determined in the IMAP assay format using the procedure outlined above. 1 μl of 25× compound was added to 1...
Ligand InfoPC cidPC sid
In DepthDetails US Patent
TargetMitogen-activated protein kinase 1(Mus musculus (Mouse))
Merck Sharp & Dohme
US Patent
LigandPNGBDBM233432(US9351965, 39 | US9351965, 40)
Affinity DataIC50:  28.5nM. Assay description: Activated ERK2 activity was also determined in the IMAP assay format using the procedure outlined above. 1 μl of 25× compound was added to 1...
Ligand InfoPC cidPC sid
In DepthDetails US Patent