BDBM233435 US9351965, 42
SMILES Cc1cc(ccn1)-c1n[nH]c2ccc(cc12)C(=O)NC1CCCC(C1)(Oc1cccc(F)c1)C(N)=O
InChI Key
Data  1 IC50
  Tab Delimited (TSV)   2D SDfile   Computed 3D by Vconf -m prep SDfile
Find this compound or compounds like it in BindingDB:
Activity Spreadsheet -- Enzyme Inhibition Constant Data from BindingDB
Found 1 hit for monomerid = 233435
TargetMitogen-activated protein kinase 1(Mus musculus (Mouse))
Merck Sharp & Dohme
US Patent
LigandPNGBDBM233435(US9351965, 42)
Affinity DataIC50:  11.2nM. Assay description: Activated ERK2 activity was also determined in the IMAP assay format using the procedure outlined above. 1 μl of 25× compound was added to 1...
Ligand InfoPC cidPC sid
In DepthDetails US Patent