BDBM233462 US9351965, 69
SMILES Cc1nc2ccccc2n1C[C@]1(O)CCC[C@@H](C1)NC(=O)c1ccc2[nH]nc(-c3ccnc(C)c3)c2c1
InChI Key
Data  1 IC50
  Tab Delimited (TSV)   2D SDfile   Computed 3D by Vconf -m prep SDfile
Find this compound or compounds like it in BindingDB:
Activity Spreadsheet -- Enzyme Inhibition Constant Data from BindingDB
Found 1 hit for monomerid = 233462
TargetMitogen-activated protein kinase 1(Mus musculus (Mouse))
Merck Sharp & Dohme
US Patent
LigandPNGBDBM233462(US9351965, 69)
Affinity DataIC50:  53nM. Assay description: Activated ERK2 activity was also determined in the IMAP assay format using the procedure outlined above. 1 μl of 25× compound was added to 1...
Ligand InfoPC cidPC sid
In DepthDetails US Patent