BDBM233659 US9353066, 1.112
SMILES OC(=O)c1cc(cc(c1)-c1cccc(Nc2nccc(n2)C(F)(F)F)c1)C#N
InChI Key InChIKey=RTOPKVYJUWSIGT-UHFFFAOYSA-N
Data  1 IC50
  Tab Delimited (TSV)   2D SDfile   Computed 3D by Vconf -m prep SDfile
Find this compound or compounds like it in BindingDB:
Activity Spreadsheet -- Enzyme Inhibition Constant Data from BindingDB
Found 1 hit for monomerid = 233659
TargetTyrosine-protein kinase SYK(Homo sapiens (Human))
Merck Sharp & Dohme
US Patent
LigandPNGBDBM233659(US9353066, 1.112)
Affinity DataIC50:  6.60nMpH: 7.5 T: 2°C. Assay description: A recombinant GST-hSYK fusion protein was used to measure potency of compounds to inhibit human Syk activity. The recombinant human GST-SYK (Carna Bi...
Ligand InfoPC cidPC sid
In DepthDetails US Patent