BDBM233695 US9353066, 2.3
SMILES CC(=O)Nc1cc(Nc2nccc(n2)C(F)(F)F)cc(c1)-c1ccc(cc1)[C@@H](O)C(F)F
InChI Key InChIKey=JLRNTBXIJRALAG-GOSISDBHSA-N
Data  1 IC50
  Tab Delimited (TSV)   2D SDfile   Computed 3D by Vconf -m prep SDfile
Find this compound or compounds like it in BindingDB:
Activity Spreadsheet -- Enzyme Inhibition Constant Data from BindingDB
Found 1 hit for monomerid = 233695
TargetTyrosine-protein kinase SYK(Homo sapiens (Human))
Merck Sharp & Dohme
US Patent
LigandPNGBDBM233695(US9353066, 2.3)
Affinity DataIC50:  6.30nMpH: 7.5 T: 2°C. Assay description: A recombinant GST-hSYK fusion protein was used to measure potency of compounds to inhibit human Syk activity. The recombinant human GST-SYK (Carna Bi...
Ligand InfoPC cidPC sid
In DepthDetails US Patent