BDBM233764 US9353066, 4.3
SMILES Cc1cc(Nc2nccc(n2)C(F)(F)F)cc(c1)-c1cccc(c1)S(=O)(=O)NCCCC(O)=O
InChI Key InChIKey=APHHQOPJGIWFBS-UHFFFAOYSA-N
Data  1 IC50
  Tab Delimited (TSV)   2D SDfile   Computed 3D by Vconf -m prep SDfile
Find this compound or compounds like it in BindingDB:
Activity Spreadsheet -- Enzyme Inhibition Constant Data from BindingDB
Found 1 hit for monomerid = 233764
TargetTyrosine-protein kinase SYK(Homo sapiens (Human))
Merck Sharp & Dohme
US Patent
LigandPNGBDBM233764(US9353066, 4.3)
Affinity DataIC50:  7.40nMpH: 7.5 T: 2°C. Assay description: A recombinant GST-hSYK fusion protein was used to measure potency of compounds to inhibit human Syk activity. The recombinant human GST-SYK (Carna Bi...
Ligand InfoPC cidPC sid
In DepthDetails US Patent