BDBM234259 US9346821, B-37
SMILES NC(=N)c1ccc(OC(=O)c2ccc(CNC3(CC3)C(=O)N[C@@H](CC(O)=O)C(O)=O)s2)c(F)c1
InChI Key InChIKey=NQKQBMSNCHBXSB-ZDUSSCGKSA-N
Data  2 KI
  Tab Delimited (TSV)   2D SDfile   Computed 3D by Vconf -m prep SDfile
Find this compound or compounds like it in BindingDB:
Activity Spreadsheet -- Enzyme Inhibition Constant Data from BindingDB
Found 1 hit for monomerid = 234259
TargetEnteropeptidase(Homo sapiens (Human))
Ajinomoto
US Patent
LigandPNGBDBM234259(US9346821, B-37)
Affinity DataKi:  1.27nMpH: 8.0Assay Description:Using a 96 well plate (#3915, Costar), a test compound (25 μL) was mixed with 20 μM fluorescence enzyme substrate (Boc-Phe-Ser-Arg-AMC, 50 ...
Ligand InfoKEGGPC cidPC sid
In DepthDetails US Patent