BDBM234969 US9556148, 40::n-(cyanomethyl)-4-(5-methyl-2-((4-(4-morpholinopiperidin-1-yl)phenyl)amino)pyrimidin-4-yl)benzamide
SMILES Cc1cnc(Nc2ccc(cc2)N2CCC(CC2)N2CCOCC2)nc1-c1ccc(cc1)C(=O)NCC#N
InChI Key InChIKey=LKTNBLBEAJCSNG-UHFFFAOYSA-N
Data  6 IC50
  Tab Delimited (TSV)   2D SDfile   Computed 3D by Vconf -m prep SDfile
Find this compound or compounds like it in BindingDB:
Activity Spreadsheet -- Enzyme Inhibition Constant Data from BindingDB
Found 6 hits for monomerid = 234969
TargetTyrosine-protein kinase JAK1(Homo sapiens (Human))
Cadila Healthcare
US Patent
LigandPNGBDBM234969(US9556148, 40 | n-(cyanomethyl)-4-(5-methyl-2-((4-...)
Affinity DataIC50:  1.30nMT: 2°C. Assay description: NCEs were screened using in vitro JAK (1, 2 and 3) kinase assay on ADP Glo platform (Promega). Fixed amount of recombinant purified human JAK (25 ng ...
Ligand InfoPC cidPC sid
In DepthDetails US Patent
TargetTyrosine-protein kinase JAK2(Homo sapiens (Human))
Cadila Healthcare
US Patent
LigandPNGBDBM234969(US9556148, 40 | n-(cyanomethyl)-4-(5-methyl-2-((4-...)
Affinity DataIC50:  2.80nMT: 2°C. Assay description: NCEs were screened using in vitro JAK (1, 2 and 3) kinase assay on ADP Glo platform (Promega). Fixed amount of recombinant purified human JAK (25 ng ...
Ligand InfoPC cidPC sid
In DepthDetails US Patent
TargetTyrosine-protein kinase JAK3(Homo sapiens (Human))
Cadila Healthcare
Curated by ChEMBL
LigandPNGBDBM234969(US9556148, 40 | n-(cyanomethyl)-4-(5-methyl-2-((4-...)
Affinity DataIC50:  12nM. Assay description: Inhibition of human JAK3 kinase domain
Ligand InfoPC cidPC sid
In DepthDetails PubMed
TargetTyrosine-protein kinase JAK1(Homo sapiens (Human))
Cadila Healthcare
US Patent
LigandPNGBDBM234969(US9556148, 40 | n-(cyanomethyl)-4-(5-methyl-2-((4-...)
Affinity DataIC50:  1nM. Assay description: Inhibition of human JAK1 kinase domain
Ligand InfoPC cidPC sid
In DepthDetails PubMed
TargetTyrosine-protein kinase JAK2(Homo sapiens (Human))
Cadila Healthcare
US Patent
LigandPNGBDBM234969(US9556148, 40 | n-(cyanomethyl)-4-(5-methyl-2-((4-...)
Affinity DataIC50:  3nM. Assay description: Inhibition of human JAK2 kinase domain
Ligand InfoPC cidPC sid
In DepthDetails PubMed
TargetTyrosine-protein kinase JAK3(Homo sapiens (Human))
Cadila Healthcare
Curated by ChEMBL
LigandPNGBDBM234969(US9556148, 40 | n-(cyanomethyl)-4-(5-methyl-2-((4-...)
Affinity DataIC50:  32nMT: 2°C. Assay description: NCEs were screened using in vitro JAK (1, 2 and 3) kinase assay on ADP Glo platform (Promega). Fixed amount of recombinant purified human JAK (25 ng ...
Ligand InfoPC cidPC sid
In DepthDetails US Patent