BDBM234997 US9556168, 1X
SMILES COC(=O)c1cccc(Cl)c1Cn1nc(-c2ccc(cc2F)C(O)=O)c2ncccc12
InChI Key InChIKey=RBRMMYDNJVNNKB-UHFFFAOYSA-N
Data  1 IC50
  Tab Delimited (TSV)   2D SDfile   Computed 3D by Vconf -m prep SDfile
Find this compound or compounds like it in BindingDB:
Activity Spreadsheet -- Enzyme Inhibition Constant Data from BindingDB
Found 1 hit for monomerid = 234997
TargetNuclear receptor ROR-gamma(Homo sapiens (Human))
Merck Sharp & Dohme
US Patent
LigandPNGBDBM234997(US9556168, 1X)
Affinity DataIC50:  3.26E+3nMpH: 7.0Assay Description:The compounds of the invention inhibit RORgammaT activity. Activation of RORgammaT activity can be measured using, e.g., biochemical TR-FRET assay. I...
Ligand InfoPC cidPC sid
In DepthDetails US Patent