BDBM235139 US9359339, 32
SMILES CC(C)C[C@@H](C(c1csc2c(cc(Cl)cc12)C#N)c1ccc(Cl)cc1)c1ccc(cc1)C(=O)NCCC(O)=O
InChI Key InChIKey=WXPKMLSJSJNPOB-MIJJZIGMSA-N
Data  1 IC50
  Tab Delimited (TSV)   2D SDfile   Computed 3D by Vconf -m prep SDfile
Find this compound or compounds like it in BindingDB:
Activity Spreadsheet -- Enzyme Inhibition Constant Data from BindingDB
Found 1 hit for monomerid = 235139
TargetGlucagon receptor(Homo sapiens (Human))
Merck Sharp & Dohme
US Patent
LigandPNGBDBM235139(US9359339, 32)
Affinity DataIC50:  1nMpH: 7.5 T: 2°C. Assay description: A stable CHO (Chinese hamster ovary) cell line expressing cloned human glucagon receptor was maintained as described (Chicchi, et. al. J Biol Chem 27...
Ligand InfoPC cidPC sid
In DepthDetails US Patent