BDBM235952 US9365539, 26
SMILES CCn1nc(cc1C1CCN(CCc2ccccc2)CC1)-c1ccc(Cl)cc1
InChI Key InChIKey=RGHSNRUDSYJWAC-UHFFFAOYSA-N
Data  1 IC50
  Tab Delimited (TSV)   2D SDfile   Computed 3D by Vconf -m prep SDfile
Find this compound or compounds like it in BindingDB:
Activity Spreadsheet -- Enzyme Inhibition Constant Data from BindingDB
Found 1 hit for monomerid = 235952
TargetLysosomal Pro-X carboxypeptidase(Homo sapiens (Human))
Merck Sharp & Dohme
US Patent
LigandPNGBDBM235952(US9365539, 26)
Affinity DataIC50:  31.8nMpH: 5.5Assay Description:The assay was run in a 384-well microliter plate at 37° C. with a total volume of 50 uL. Final assay concentrations were 0.13 nM human PrCP (CHO) or ...
Ligand InfoPC cidPC sid
In DepthDetails US Patent