BDBM235959 US9365539, 81
SMILES CO[C@@H](CN1CCC(CC1)c1nc(nn1-c1ncccn1)-c1ccc(F)cc1)c1ccccc1
InChI Key InChIKey=SDXDIULIKNCCGO-QHCPKHFHSA-N
Data  1 IC50
  Tab Delimited (TSV)   2D SDfile   Computed 3D by Vconf -m prep SDfile
Find this compound or compounds like it in BindingDB:
Activity Spreadsheet -- Enzyme Inhibition Constant Data from BindingDB
Found 1 hit for monomerid = 235959
TargetLysosomal Pro-X carboxypeptidase(Homo sapiens (Human))
Merck Sharp & Dohme
US Patent
LigandPNGBDBM235959(US9365539, 81)
Affinity DataIC50:  2.58nMpH: 5.5Assay Description:The assay was run in a 384-well microliter plate at 37° C. with a total volume of 50 uL. Final assay concentrations were 0.13 nM human PrCP (CHO) or ...
Ligand InfoPC cidPC sid
In DepthDetails US Patent