BDBM23622 2-({6-[bis(2-hydroxyethyl)amino]-4,8-bis(pyrrolidin-1-yl)pyrimido[5,4-d][1,3]diazin-2-yl}(2-hydroxyethyl)amino)ethan-1-ol::Dipyridamole Analogue, 2
SMILES OCCN(CCO)c1nc(N2CCCC2)c2nc(nc(N3CCCC3)c2n1)N(CCO)CCO
InChI Key InChIKey=HHBOIBAGPNJLIL-UHFFFAOYSA-N
Data  1 KI  1 IC50
  Tab Delimited (TSV)   2D SDfile   Computed 3D by Vconf -m prep SDfile
Find this compound or compounds like it in BindingDB:
Activity Spreadsheet -- Enzyme Inhibition Constant Data from BindingDB
Found 1 hit for monomerid = 23622
TargetEquilibrative nucleoside transporter 1(Homo sapiens (Human))
University of Tennessee Health Science Center
LigandPNGBDBM23622(2-({6-[bis(2-hydroxyethyl)amino]-4,8-bis(pyrrolidi...)
Affinity DataKi:  99.7nM ΔG°:  -9.45kcal/mole IC50:  1.76E+3nMpH: 7.4 T: 2°C. Assay description: The compounds were tested to determine their ENT1 nucleoside transporter binding ability by a flow cytometric assay using human leukemia K562 cells i...
In DepthDetails ArticlePubMed