BDBM23639 2-({6-[bis(2-hydroxyethyl)amino]-4,8-bis(dimethylamino)pyrimido[5,4-d][1,3]diazin-2-yl}(2-hydroxyethyl)amino)ethan-1-ol::Dipyridamole Analogue, 21
SMILES CN(C)c1nc(nc2c(nc(nc12)N(CCO)CCO)N(C)C)N(CCO)CCO
InChI Key InChIKey=DSXWYDOIBJBCKJ-UHFFFAOYSA-N
Data  1 KI  1 IC50
  Tab Delimited (TSV)   2D SDfile   Computed 3D by Vconf -m prep SDfile
Find this compound or compounds like it in BindingDB:
Activity Spreadsheet -- Enzyme Inhibition Constant Data from BindingDB
Found 1 hit for monomerid = 23639
TargetEquilibrative nucleoside transporter 1(Homo sapiens (Human))
University of Tennessee Health Science Center
LigandPNGBDBM23639(2-({6-[bis(2-hydroxyethyl)amino]-4,8-bis(dimethyla...)
Affinity DataKi:  217nM ΔG°:  -8.99kcal/mole IC50:  3.83E+3nMpH: 7.4 T: 2°C. Assay description: The compounds were tested to determine their ENT1 nucleoside transporter binding ability by a flow cytometric assay using human leukemia K562 cells i...
In DepthDetails ArticlePubMed