BDBM23664 2-({6-[bis(2-hydroxyethyl)amino]-4,8-bis(propan-2-ylamino)pyrimido[5,4-d][1,3]diazin-2-yl}(2-hydroxyethyl)amino)ethan-1-ol::Dipyridamole Analogue, 46
SMILES CC(C)Nc1nc(nc2c(NC(C)C)nc(nc12)N(CCO)CCO)N(CCO)CCO
InChI Key InChIKey=ROPFQZIIAHWWNL-UHFFFAOYSA-N
Data  1 KI  1 IC50
  Tab Delimited (TSV)   2D SDfile   Computed 3D by Vconf -m prep SDfile
Find this compound or compounds like it in BindingDB:
Activity Spreadsheet -- Enzyme Inhibition Constant Data from BindingDB
Found 1 hit for monomerid = 23664
TargetEquilibrative nucleoside transporter 1(Homo sapiens (Human))
University of Tennessee Health Science Center
LigandPNGBDBM23664(2-({6-[bis(2-hydroxyethyl)amino]-4,8-bis(propan-2-...)
Affinity DataKi:  191nM IC50:  3.38E+3nM. Assay description: The compounds were tested to determine their ENT1 nucleoside transporter binding ability by a flow cytometric assay using human leukemia K562 cells i...
In DepthDetails ArticlePubMed