BDBM23670 2-({6-[bis(2-hydroxyethyl)amino]-4,8-bis(tert-butylamino)pyrimido[5,4-d][1,3]diazin-2-yl}(2-hydroxyethyl)amino)ethan-1-ol::Dipyridamole Analogue, 52
SMILES CC(C)(C)Nc1nc(nc2c(NC(C)(C)C)nc(nc12)N(CCO)CCO)N(CCO)CCO
InChI Key InChIKey=MEXKRNKLNAUNFE-UHFFFAOYSA-N
Data  1 KI  1 IC50
  Tab Delimited (TSV)   2D SDfile   Computed 3D by Vconf -m prep SDfile
Find this compound or compounds like it in BindingDB:
Activity Spreadsheet -- Enzyme Inhibition Constant Data from BindingDB
Found 1 hit for monomerid = 23670
TargetEquilibrative nucleoside transporter 1(Homo sapiens (Human))
University of Tennessee Health Science Center
LigandPNGBDBM23670(2-({6-[bis(2-hydroxyethyl)amino]-4,8-bis(tert-buty...)
Affinity DataKi:  16.8nM IC50:  297nM. Assay description: The compounds were tested to determine their ENT1 nucleoside transporter binding ability by a flow cytometric assay using human leukemia K562 cells i...
In DepthDetails ArticlePubMed