BDBM23692 Dipyridamole Analogue, 74::{2-[(6-{bis[2-(formyloxy)ethyl]amino}-4,8-bis(piperidin-1-yl)pyrimido[5,4-d][1,3]diazin-2-yl)[2-(formyloxy)ethyl]amino]ethyl} formate
SMILES O=COCCN(CCOC=O)c1nc(N2CCCCC2)c2nc(nc(N3CCCCC3)c2n1)N(CCOC=O)CCOC=O
InChI Key InChIKey=BQYYXJQPCJBXLF-UHFFFAOYSA-N
Data  1 KI  1 IC50
  Tab Delimited (TSV)   2D SDfile   Computed 3D by Vconf -m prep SDfile
Find this compound or compounds like it in BindingDB:
Activity Spreadsheet -- Enzyme Inhibition Constant Data from BindingDB
Found 1 hit for monomerid = 23692
TargetEquilibrative nucleoside transporter 1(Homo sapiens (Human))
University of Tennessee Health Science Center
LigandPNGBDBM23692(Dipyridamole Analogue, 74 | {2-[(6-{bis[2-(formylo...)
Affinity DataKi:  8.20nM IC50:  145nM. Assay description: The compounds were tested to determine their ENT1 nucleoside transporter binding ability by a flow cytometric assay using human leukemia K562 cells i...
In DepthDetails ArticlePubMed