BDBM237944 US9394285, 25
SMILES COc1cc(ccc1C1(O)CCC1)-c1cc2c(c[nH]c2cc1F)C(O)=O
InChI Key InChIKey=GEDJJMKZSDIMAR-UHFFFAOYSA-N
Data  1 EC50
  Tab Delimited (TSV)   2D SDfile   Computed 3D by Vconf -m prep SDfile
Find this compound or compounds like it in BindingDB:
Activity Spreadsheet -- Enzyme Inhibition Constant Data from BindingDB
Found 1 hit for monomerid = 237944
LigandPNGBDBM237944(US9394285, 25)
Affinity DataEC50:  111nMpH: 7.5 T: 2°C. Assay description: The biochemical EC50 (half-maximal concentration required for full activation) of compounds for the activation of AMPK was evaluated by 33P-based ass...
Ligand InfoPC cidPC sid
In DepthDetails US Patent