BDBM238925 US9403831, 6
SMILES Cn1cc(cn1)-c1cnc2nnn(C[C@@H]3CN(CCO3)c3ncc(cn3)-c3cnn(c3)C3CCNCC3)c2n1
InChI Key InChIKey=KZFABQHMVLXYQC-NRFANRHFSA-N
Data  1 IC50
  Tab Delimited (TSV)   2D SDfile   Computed 3D by Vconf -m prep SDfile
Find this compound or compounds like it in BindingDB:
Activity Spreadsheet -- Enzyme Inhibition Constant Data from BindingDB
Found 1 hit for monomerid = 238925
TargetHepatocyte growth factor receptor(Homo sapiens (Human))
Korea Research Institute of Chemical Technology
US Patent
LigandPNGBDBM238925(US9403831, 6)
Affinity DataIC50:  2nMT: 2°C. Assay description: The c-Met kinase inhibitory activity was analyzed using dissociation enhanced lanthanide fluoro-immunoassay (DELFIA, Perkin Elmer), which is a kind o...
Ligand InfoPC cidPC sid
In DepthDetails US Patent