BDBM238984 US9403846, 2
SMILES NC1=N[C@]2(CO[C@H](C[C@H]2CS1)C1CC1)c1ccc(F)cc1F
InChI Key InChIKey=RHJJDGACVHKXNA-JJMVLAAESA-N
Data  2 IC50
  Tab Delimited (TSV)   2D SDfile   Computed 3D by Vconf -m prep SDfile
Find this compound or compounds like it in BindingDB:
Activity Spreadsheet -- Enzyme Inhibition Constant Data from BindingDB
Found 2 hits for monomerid = 238984
TargetBeta-secretase 2 [21-466](Homo sapiens (Human))
Pfizer
US Patent
LigandPNGBDBM238984(US9403846, 2)
Affinity DataIC50:  2.26E+3nMpH: 4.5 T: 2°C. Assay description: A synthetic substrate that can be cleaved by BACE2 having N-terminal biotin and made fluorescent by the covalent attachment of Oregon Green at the Cy...
Ligand InfoPC cidPC sid
In DepthDetails US Patent
TargetBeta-secretase 1(Homo sapiens (Human))
Pfizer
US Patent
LigandPNGBDBM238984(US9403846, 2)
Affinity DataIC50:  281nMpH: 4.5Assay Description:A synthetic APP substrate that can be cleaved by beta-secretase having N-terminal biotin and made fluorescent by the covalent attachment of Oregon Gr...
Ligand InfoPC cidPC sid
In DepthDetails US Patent