BDBM240115 US9403813, 19
SMILES COc1c(F)cccc1-c1noc(n1)[C@@H]1CCN1C(=O)c1ccc(C)cc1-n1nccn1
InChI Key InChIKey=HJDKRWJGSBWZFK-KRWDZBQOSA-N
Data  2 IC50
  Tab Delimited (TSV)   2D SDfile   Computed 3D by Vconf -m prep SDfile
Find this compound or compounds like it in BindingDB:
Activity Spreadsheet -- Enzyme Inhibition Constant Data from BindingDB
Found 2 hits for monomerid = 240115
TargetOrexin receptor type 2(Homo sapiens (Human))
Actelion Pharmaceuticals
US Patent
LigandPNGBDBM240115(US9403813, 19)
Affinity DataIC50:  9nMT: 2°C. Assay description: Chinese hamster ovary (CHO) cells expressing the human orexin-1 receptor and the human orexin-2 receptor, respectively, are grown in culture medium (...
Ligand InfoPC cidPC sid
In DepthDetails US Patent
TargetOrexin/Hypocretin receptor type 1(Homo sapiens (Human))
Actelion Pharmaceuticals
US Patent
LigandPNGBDBM240115(US9403813, 19)
Affinity DataIC50:  44nMT: 2°C. Assay description: Chinese hamster ovary (CHO) cells expressing the human orexin-1 receptor and the human orexin-2 receptor, respectively, are grown in culture medium (...
Ligand InfoPC cidPC sid
In DepthDetails US Patent