BDBM240188 US9403813, 93
SMILES Cc1ccc(c(c1)C(=O)N1CC[C@H]1c1noc(n1)-c1cccc(F)c1C)-n1nccn1
InChI Key InChIKey=XODWTMJEFQLUSV-IBGZPJMESA-N
Data  2 IC50
  Tab Delimited (TSV)   2D SDfile   Computed 3D by Vconf -m prep SDfile
Find this compound or compounds like it in BindingDB:
Activity Spreadsheet -- Enzyme Inhibition Constant Data from BindingDB
Found 2 hits for monomerid = 240188
TargetOrexin/Hypocretin receptor type 1(Homo sapiens (Human))
Actelion Pharmaceuticals
US Patent
LigandPNGBDBM240188(US9403813, 93)
Affinity DataIC50:  655nMT: 2°C. Assay description: Chinese hamster ovary (CHO) cells expressing the human orexin-1 receptor and the human orexin-2 receptor, respectively, are grown in culture medium (...
Ligand InfoPC cidPC sid
In DepthDetails US Patent
TargetOrexin receptor type 2(Homo sapiens (Human))
Actelion Pharmaceuticals
US Patent
LigandPNGBDBM240188(US9403813, 93)
Affinity DataIC50:  8nMT: 2°C. Assay description: Chinese hamster ovary (CHO) cells expressing the human orexin-1 receptor and the human orexin-2 receptor, respectively, are grown in culture medium (...
Ligand InfoPC cidPC sid
In DepthDetails US Patent