BDBM240208 US9403813, 114
SMILES Cc1ccc(-c2ccccc2)c(c1)C(=O)N1CC[C@H]1c1noc(n1)-c1cccc(Cl)c1C
InChI Key InChIKey=ZYAAECIWBVGBRR-QHCPKHFHSA-N
Data  2 IC50
  Tab Delimited (TSV)   2D SDfile   Computed 3D by Vconf -m prep SDfile
Find this compound or compounds like it in BindingDB:
Activity Spreadsheet -- Enzyme Inhibition Constant Data from BindingDB
Found 2 hits for monomerid = 240208
TargetOrexin/Hypocretin receptor type 1(Homo sapiens (Human))
Actelion Pharmaceuticals
US Patent
LigandPNGBDBM240208(US9403813, 114)
Affinity DataIC50:  26nMT: 2°C. Assay description: Chinese hamster ovary (CHO) cells expressing the human orexin-1 receptor and the human orexin-2 receptor, respectively, are grown in culture medium (...
Ligand InfoPC cidPC sid
In DepthDetails US Patent
TargetOrexin receptor type 2(Homo sapiens (Human))
Actelion Pharmaceuticals
US Patent
LigandPNGBDBM240208(US9403813, 114)
Affinity DataIC50:  2nMT: 2°C. Assay description: Chinese hamster ovary (CHO) cells expressing the human orexin-1 receptor and the human orexin-2 receptor, respectively, are grown in culture medium (...
Ligand InfoPC cidPC sid
In DepthDetails US Patent