BDBM240795 H-D-Ser-homoCha-Arg-OH (6)
SMILES N[C@H](CO)C(=O)N[C@H](CCC1CCCCC1)C(=O)N[C@H](CCCNC(N)=N)C(O)=O
InChI Key InChIKey=COGDSKAASPYTCL-RBSFLKMASA-N
Data  4 KI
  Tab Delimited (TSV)   2D SDfile   Computed 3D by Vconf -m prep SDfile
Find this compound or compounds like it in BindingDB:
Activity Spreadsheet -- Enzyme Inhibition Constant Data from BindingDB
Found 4 hits for monomerid = 240795
TargetPlasminogen(Homo sapiens (Human))
Medical University of Bialystok
LigandPNGBDBM240795(H-D-Ser-homoCha-Arg-OH (6))
Affinity DataKi:  1.12E+4nMpH: 7.4Assay Description:Buffer and 0.1 mL of enzyme solution was added to 0.2 mL of examined compounddissolved in 0.15 M NaCl (as control 0.15 M NaCl). The buffer and the en...
Ligand InfoKEGGPC cidPC sid
In DepthDetails ArticlePubMed
TargetProthrombin(Homo sapiens (Human))
Medical University of Bialystok
LigandPNGBDBM240795(H-D-Ser-homoCha-Arg-OH (6))
Affinity DataKi:  1.81E+4nMpH: 8.4Assay Description:Buffer and 0.1 mL of enzyme solution was added to 0.2 mL of examined compounddissolved in 0.15 M NaCl (as control 0.15 M NaCl). The buffer and the en...
Ligand InfoKEGGPC cidPC sid
In DepthDetails ArticlePubMed
TargetSerine protease 1(Homo sapiens (Human))
Medical University of Bialystok
LigandPNGBDBM240795(H-D-Ser-homoCha-Arg-OH (6))
Affinity DataKi:  2.72E+4nMpH: 7.5Assay Description:Buffer and 0.1 mL of enzyme solution was added to 0.2 mL of examined compounddissolved in 0.15 M NaCl (as control 0.15 M NaCl). The buffer and the en...
Ligand InfoKEGGPC cidPC sid
In DepthDetails ArticlePubMed
TargetUrokinase-type plasminogen activator(Homo sapiens (Human))
Medical University of Bialystok
LigandPNGBDBM240795(H-D-Ser-homoCha-Arg-OH (6))
Affinity DataKi:  4.51E+5nMpH: 8.8Assay Description:Buffer and 0.1 mL of enzyme solution was added to 0.2 mL of examined compounddissolved in 0.15 M NaCl (as control 0.15 M NaCl). The buffer and the en...
Ligand InfoKEGGPC cidPC sid
In DepthDetails ArticlePubMed