BDBM241181 US10479788, Example 23::US11046688, Example 23::US9409907, 23
SMILES Cn1cc(cn1)-c1ccc(Nc2cc3c(cccc3cn2)-c2cnn(C)c2)c(Cl)c1
InChI Key InChIKey=AFYTVYVYMOQWPI-UHFFFAOYSA-N
Data  2 IC50
  Tab Delimited (TSV)   2D SDfile   Computed 3D by Vconf -m prep SDfile
Find this compound or compounds like it in BindingDB:
Activity Spreadsheet -- Enzyme Inhibition Constant Data from BindingDB
Found 2 hits for monomerid = 241181
TargetDual specificity protein kinase TTK(Homo sapiens (Human))
Cancer Research Technology
US Patent
LigandPNGBDBM241181(US10479788, Example 23 | US11046688, Example 23 | ...)
Affinity DataIC50:  225nM. Assay description: The enzyme reaction (total volume 10 μl) was carried out in black 384-well low volume plates containing full length MPS1 (12.5 nM or 3 nM), fluo...
Ligand InfoPC cidPC sid
In DepthDetails US Patent
TargetDual specificity protein kinase TTK(Homo sapiens (Human))
Cancer Research Technology
US Patent
LigandPNGBDBM241181(US10479788, Example 23 | US11046688, Example 23 | ...)
Affinity DataIC50:  225nMpH: 7.0 T: 2°C. Assay description: The enzyme reaction (total volume 10 μl) was carried out in black 384-well low volume plates containing full length MPS1 (12.5 nM or 3 nM), fluo...
Ligand InfoPC cidPC sid
In DepthDetails US Patent