BDBM242466 US9422235, 42
SMILES FC(F)(F)c1cc(NC2CC3CCC2C3)ccc1S(=O)(=O)NCc1ccco1
InChI Key InChIKey=ZBPOEOJUGLPFAD-UHFFFAOYSA-N
Data  1 KI  1 IC50
  Tab Delimited (TSV)   2D SDfile   Computed 3D by Vconf -m prep SDfile
Find this compound or compounds like it in BindingDB:
Activity Spreadsheet -- Enzyme Inhibition Constant Data from BindingDB
Found 1 hit for monomerid = 242466
TargetCannabinoid receptor 2(Homo sapiens (Human))
Pharmos
US Patent
LigandPNGBDBM242466(US9422235, 42)
Affinity DataKi:  140nM ΔG°:  -9.50kcal/mole IC50:  245nMT: 2°C. Assay description: The binding assays were performed by testing the ability of the new compounds to displace the radiolabeled synthetic non-selective cannabinoid agonis...
Ligand InfoPC cidPC sid
In DepthDetails US Patent