BDBM242467 US9422235, 43
SMILES FC(F)(F)c1cc(Nc2ccc(cc2Cl)C#N)ccc1S(=O)(=O)NCC1CC1
InChI Key InChIKey=OEAPZJRTUHPZNF-UHFFFAOYSA-N
Data  1 KI  1 IC50
  Tab Delimited (TSV)   2D SDfile   Computed 3D by Vconf -m prep SDfile
Find this compound or compounds like it in BindingDB:
Activity Spreadsheet -- Enzyme Inhibition Constant Data from BindingDB
Found 1 hit for monomerid = 242467
TargetCannabinoid receptor 2(Homo sapiens (Human))
Pharmos
US Patent
LigandPNGBDBM242467(US9422235, 43)
Affinity DataKi:  29nM ΔG°:  -10.4kcal/mole IC50:  50.2nMT: 2°C. Assay description: The binding assays were performed by testing the ability of the new compounds to displace the radiolabeled synthetic non-selective cannabinoid agonis...
Ligand InfoPC cidPC sid
In DepthDetails US Patent