BDBM242471 US9422235, 47
SMILES FC(F)(F)c1cc(Nc2ccc3OCCOc3c2)ccc1S(=O)(=O)NCC1CC1
InChI Key InChIKey=LBPDHYFBYQARGS-UHFFFAOYSA-N
Data  1 KI  1 IC50
  Tab Delimited (TSV)   2D SDfile   Computed 3D by Vconf -m prep SDfile
Find this compound or compounds like it in BindingDB:
Activity Spreadsheet -- Enzyme Inhibition Constant Data from BindingDB
Found 1 hit for monomerid = 242471
TargetCannabinoid receptor 2(Homo sapiens (Human))
Pharmos
US Patent
LigandPNGBDBM242471(US9422235, 47)
Affinity DataKi:  75.1nM ΔG°:  -9.88kcal/mole IC50:  138nMT: 2°C. Assay description: The binding assays were performed by testing the ability of the new compounds to displace the radiolabeled synthetic non-selective cannabinoid agonis...
Ligand InfoPC cidPC sid
In DepthDetails US Patent