BDBM242484 US9422235, 65
SMILES FC(F)(F)c1cc(Nc2ccc(Cl)cc2Cl)ccc1S(=O)(=O)Nc1ccccc1
InChI Key InChIKey=BXDQYUTYRFSFDI-UHFFFAOYSA-N
Data  1 KI  1 IC50
  Tab Delimited (TSV)   2D SDfile   Computed 3D by Vconf -m prep SDfile
Find this compound or compounds like it in BindingDB:
Activity Spreadsheet -- Enzyme Inhibition Constant Data from BindingDB
Found 1 hit for monomerid = 242484
TargetCannabinoid receptor 2(Homo sapiens (Human))
Pharmos
US Patent
LigandPNGBDBM242484(US9422235, 65)
Affinity DataKi:  3.51E+3nM ΔG°:  -7.56kcal/mole IC50:  6.25E+3nMT: 2°C. Assay description: The binding assays were performed by testing the ability of the new compounds to displace the radiolabeled synthetic non-selective cannabinoid agonis...
Ligand InfoPC cidPC sid
In DepthDetails US Patent