BDBM242503 US9422235, 86
SMILES CC(=O)N(CC1CC1)S(=O)(=O)c1ccc(NC2CC3CCC2C3)cc1C(F)(F)F
InChI Key InChIKey=BELXSNHDWLQLEM-UHFFFAOYSA-N
Data  2 KI  2 IC50
  Tab Delimited (TSV)   2D SDfile   Computed 3D by Vconf -m prep SDfile
Find this compound or compounds like it in BindingDB:
Activity Spreadsheet -- Enzyme Inhibition Constant Data from BindingDB
Found 2 hits for monomerid = 242503
TargetCannabinoid receptor 2(Homo sapiens (Human))
Pharmos
US Patent
LigandPNGBDBM242503(US9422235, 86)
Affinity DataKi:  186nM ΔG°:  -9.33kcal/mole IC50:  431nMT: 2°C. Assay description: The binding assays were performed by testing the ability of the new compounds to displace the radiolabeled synthetic non-selective cannabinoid agonis...
Ligand InfoPC cidPC sid
In DepthDetails US Patent
TargetCannabinoid receptor 2(Homo sapiens (Human))
Pharmos
US Patent
LigandPNGBDBM242503(US9422235, 86)
Affinity DataKi:  264nM ΔG°:  -9.12kcal/mole IC50:  467nMT: 2°C. Assay description: The binding assays were performed by testing the ability of the new compounds to displace the radiolabeled synthetic non-selective cannabinoid agonis...
Ligand InfoPC cidPC sid
In DepthDetails US Patent