BDBM242504 US9422235, 87
SMILES FC(F)(F)c1cc(NC2CCCCCC2)ccc1S(=O)(=O)NCC1CC1
InChI Key InChIKey=XRTKQERZAXKTBR-UHFFFAOYSA-N
Data  3 KI  3 IC50
  Tab Delimited (TSV)   2D SDfile   Computed 3D by Vconf -m prep SDfile
Find this compound or compounds like it in BindingDB:
Activity Spreadsheet -- Enzyme Inhibition Constant Data from BindingDB
Found 3 hits for monomerid = 242504
TargetCannabinoid receptor 2(Homo sapiens (Human))
Pharmos
US Patent
LigandPNGBDBM242504(US9422235, 87)
Affinity DataKi:  23nM ΔG°:  -10.6kcal/mole IC50:  37nMT: 2°C. Assay description: The binding assays were performed by testing the ability of the new compounds to displace the radiolabeled synthetic non-selective cannabinoid agonis...
Ligand InfoPC cidPC sid
In DepthDetails US Patent
TargetCannabinoid receptor 2(Homo sapiens (Human))
Pharmos
US Patent
LigandPNGBDBM242504(US9422235, 87)
Affinity DataKi:  33nM ΔG°:  -10.4kcal/mole IC50:  78nMT: 2°C. Assay description: The binding assays were performed by testing the ability of the new compounds to displace the radiolabeled synthetic non-selective cannabinoid agonis...
Ligand InfoPC cidPC sid
In DepthDetails US Patent
TargetCannabinoid receptor 1(Homo sapiens (Human))
Pharmos
US Patent
LigandPNGBDBM242504(US9422235, 87)
Affinity DataKi:  3.00E+3nM ΔG°:  -7.66kcal/mole IC50:  6.00E+3nMT: 2°C. Assay description: The binding assays were performed by testing the ability of the new compounds to displace the radiolabeled synthetic non-selective cannabinoid agonis...
Ligand InfoPC cidPC sid
In DepthDetails US Patent