BDBM242511 US9422235, 94
SMILES FC(F)(F)c1cc(NN2CCCCC2)ccc1S(=O)(=O)NCC1CC1
InChI Key InChIKey=SFRXOSJENFVHGX-UHFFFAOYSA-N
Data  2 KI  2 IC50
  Tab Delimited (TSV)   2D SDfile   Computed 3D by Vconf -m prep SDfile
Find this compound or compounds like it in BindingDB:
Activity Spreadsheet -- Enzyme Inhibition Constant Data from BindingDB
Found 2 hits for monomerid = 242511
TargetCannabinoid receptor 2(Homo sapiens (Human))
Pharmos
US Patent
LigandPNGBDBM242511(US9422235, 94)
Affinity DataKi:  85nM ΔG°:  -9.80kcal/mole IC50:  146nMT: 2°C. Assay description: The binding assays were performed by testing the ability of the new compounds to displace the radiolabeled synthetic non-selective cannabinoid agonis...
Ligand InfoPC cidPC sid
In DepthDetails US Patent
TargetCannabinoid receptor 1(Homo sapiens (Human))
Pharmos
US Patent
LigandPNGBDBM242511(US9422235, 94)
Affinity DataKi:  3.00E+3nM ΔG°:  -7.66kcal/mole IC50:  6.00E+3nMT: 2°C. Assay description: The binding assays were performed by testing the ability of the new compounds to displace the radiolabeled synthetic non-selective cannabinoid agonis...
Ligand InfoPC cidPC sid
In DepthDetails US Patent