BDBM242525 US9422235, 110
SMILES CC1(C)C2CC1(C)CC(C2)Nc1ccc(c(c1)C(F)(F)F)S(=O)(=O)NCC1CC1
InChI Key InChIKey=QNQBMKKGGDBJFE-UHFFFAOYSA-N
Data  1 KI  1 IC50
  Tab Delimited (TSV)   2D SDfile   Computed 3D by Vconf -m prep SDfile
Find this compound or compounds like it in BindingDB:
Activity Spreadsheet -- Enzyme Inhibition Constant Data from BindingDB
Found 1 hit for monomerid = 242525
TargetCannabinoid receptor 2(Homo sapiens (Human))
Pharmos
US Patent
LigandPNGBDBM242525(US9422235, 110)
Affinity DataKi:  18.8nM ΔG°:  -10.7kcal/mole IC50:  37.2nMT: 2°C. Assay description: The binding assays were performed by testing the ability of the new compounds to displace the radiolabeled synthetic non-selective cannabinoid agonis...
Ligand InfoPC cidPC sid
In DepthDetails US Patent