BDBM243032 2-[4-(3-Methylphenyl)piperazine-1-yl]-N-[4-(2-methylthiazol-4-yl)phenyl]acetamide (5j)
SMILES Cc1nc(cs1)-c1ccc(NC(=O)CN2CCN(CC2)c2cccc(C)c2)cc1
InChI Key InChIKey=WJSHXGVHVPYMGB-UHFFFAOYSA-N
Data  2 IC50
  Tab Delimited (TSV)   2D SDfile   Computed 3D by Vconf -m prep SDfile
Find this compound or compounds like it in BindingDB:
Activity Spreadsheet -- Enzyme Inhibition Constant Data from BindingDB
Found 2 hits for monomerid = 243032
TargetAcetylcholinesterase(Electrophorus electricus (Electric eel))
Anadolu University
LigandPNGBDBM243032(2-[4-(3-Methylphenyl)piperazine-1-yl]-N-[4-(2-meth...)
Affinity DataIC50:  8.84E+4nMpH: 8.0 T: 2°C. Assay description: Enzyme solutions were prepared in gelatine solution (1%), at a concentration of 2.5 units/mL. AChE or BChE solution (50 μL) and compound solutio...
Ligand InfoPC cidPC sid
In DepthDetails ArticlePubMed
TargetCarboxylic ester hydrolase(Equus caballus (Horse))
Anadolu University
LigandPNGBDBM243032(2-[4-(3-Methylphenyl)piperazine-1-yl]-N-[4-(2-meth...)
Affinity DataIC50: >1.00E+5nM. Assay description: Enzyme solutions were prepared in gelatine solution (1%), at a concentration of 2.5 units/mL. AChE or BChE solution (50 μL) and compound solutio...
Ligand InfoPC cidPC sid
In DepthDetails ArticlePubMed