BDBM24313 4-[(4-hydroxy-3-methoxyphenyl)(1H-1,2,4-triazol-1-yl)methyl]-2-methoxyphenol::Letrozole derivative, 21
SMILES COc1cc(ccc1O)C(c1ccc(O)c(OC)c1)n1cncn1
InChI Key InChIKey=COEBLOLVVKRFEF-UHFFFAOYSA-N
Data  1 IC50
  Tab Delimited (TSV)   2D SDfile   Computed 3D by Vconf -m prep SDfile
Find this compound or compounds like it in BindingDB:
Activity Spreadsheet -- Enzyme Inhibition Constant Data from BindingDB
Found 1 hit for monomerid = 24313
TargetAromatase(Homo sapiens (Human))
University of Bath
LigandPNGBDBM24313(4-[(4-hydroxy-3-methoxyphenyl)(1H-1,2,4-triazol-1-...)
Affinity DataIC50:  215nMpH: 7.5 T: 2°C. Assay description: The extent of in vitro inhibition of aromatase activities was assessed using intact monolayers of JEG-3 cells. Aromatase activity was measured using ...
In DepthDetails ArticlePubMed