BDBM24318 4-[(S)-(3-bromo-4-hydroxyphenyl)(1H-1,2,4-triazol-1-yl)methyl]benzonitrile::Letrozole derivative, 39b S-(-)
SMILES Oc1ccc(cc1Br)[C@H](c1ccc(cc1)C#N)n1cncn1
InChI Key InChIKey=FCWRPKMHVLOWPB-INIZCTEOSA-N
Data  1 IC50
  Tab Delimited (TSV)   2D SDfile   Computed 3D by Vconf -m prep SDfile
Find this compound or compounds like it in BindingDB:
Activity Spreadsheet -- Enzyme Inhibition Constant Data from BindingDB
Found 1 hit for monomerid = 24318
TargetAromatase(Homo sapiens (Human))
University of Bath
LigandPNGBDBM24318(4-[(S)-(3-bromo-4-hydroxyphenyl)(1H-1,2,4-triazol-...)
Affinity DataIC50:  3.40nMpH: 7.5 T: 2°C. Assay description: The extent of in vitro inhibition of aromatase activities was assessed using intact monolayers of JEG-3 cells. Aromatase activity was measured using ...
In DepthDetails ArticlePubMed