BDBM243579 US9428456, 2.068
SMILES CNC(=O)C1CCN(Cc2cccc(NC(=O)c3cccc(n3)C(F)(F)F)c2)CC1
InChI Key InChIKey=UNOSFMVQUBZGHO-UHFFFAOYSA-N
Data  1 EC50
  Tab Delimited (TSV)   2D SDfile   Computed 3D by Vconf -m prep SDfile
Find this compound or compounds like it in BindingDB:
Activity Spreadsheet -- Enzyme Inhibition Constant Data from BindingDB
Found 1 hit for monomerid = 243579
TargetAtypical chemokine receptor 3(Homo sapiens (Human))
Actelion Pharmaceuticals
US Patent
LigandPNGBDBM243579(US9428456, 2.068)
Affinity DataEC50:  4nMT: 2°C. Assay description: CHO-K1 CXCR7 b-arrestin cells are detached from culture dishes with a cell dissociation buffer (Invitrogen, #13151-014) and collected in growing medi...
Ligand InfoPC cidPC sid
In DepthDetails US Patent