BDBM244751 US10226449, cpd 361::US9428502, 361
SMILES COCCc1nc(Cl)c([nH]1)-c1cc(ccc1C)C(=O)N1CC(C1)c1ccc(cc1)C#N
InChI Key InChIKey=SEIWGLRQKXGYFV-UHFFFAOYSA-N
Data  2 IC50
  Tab Delimited (TSV)   2D SDfile   Computed 3D by Vconf -m prep SDfile
Find this compound or compounds like it in BindingDB:
Activity Spreadsheet -- Enzyme Inhibition Constant Data from BindingDB
Found 1 hit for monomerid = 244751
TargetFatty acid synthase(Homo sapiens (Human))
3-V Biosciences
US Patent
LigandPNGBDBM244751(US10226449, cpd 361 | US9428502, 361)
Affinity DataIC50:  13nM. Assay description: FASN activity of the SKBr3 cell extract was determined by measuring either NADPH oxidation or the amount of thiol-containing coenzyme A (CoA) release...
Ligand InfoPC cidPC sid
In DepthDetails US Patent