BDBM245156 US9428460, 12
SMILES Fc1cccc(c1)C(=O)N[C@H]1CC[C@@H](CC1)Oc1ccnc2c(Br)cccc12
InChI Key InChIKey=ZMKIYBGNNRFQBA-QAQDUYKDSA-N
Data  1 IC50
  Tab Delimited (TSV)   2D SDfile   Computed 3D by Vconf -m prep SDfile
Find this compound or compounds like it in BindingDB:
Activity Spreadsheet -- Enzyme Inhibition Constant Data from BindingDB
Found 1 hit for monomerid = 245156
TargetAndrogen receptor(Homo sapiens (Human))
Bayer Pharma Aktiengesellschaft
US Patent
LigandPNGBDBM245156(US9428460, 12)
Affinity DataIC50:  93nMT: 2°C. Assay description: For determining the androgen receptor-dependent transcription, a cellular assay system was used, consisting of PC-3 cells (Kaighn et al., Invest. Uro...
Ligand InfoPC cidPC sid
In DepthDetails US Patent