BDBM245169 US9428460, 25
SMILES Fc1ccc(cc1)C(=O)N[C@H]1CC[C@@H](CC1)Oc1ccnc2c(cccc12)C#N
InChI Key InChIKey=JQWACGAKOYFPLO-WGSAOQKQSA-N
Data  1 IC50
  Tab Delimited (TSV)   2D SDfile   Computed 3D by Vconf -m prep SDfile
Find this compound or compounds like it in BindingDB:
Activity Spreadsheet -- Enzyme Inhibition Constant Data from BindingDB
Found 1 hit for monomerid = 245169
TargetAndrogen receptor(Homo sapiens (Human))
Bayer Pharma Aktiengesellschaft
US Patent
LigandPNGBDBM245169(US9428460, 25)
Affinity DataIC50:  140nMT: 2°C. Assay description: For determining the androgen receptor-dependent transcription, a cellular assay system was used, consisting of PC-3 cells (Kaighn et al., Invest. Uro...
Ligand InfoPC cidPC sid
In DepthDetails US Patent