BDBM245589 US9428508, 44
SMILES CCC(C)NS(=O)(=O)c1ccccc1Nc1nc(Nc2ccc(cc2OC)N2CCOCC2)nc2NCCc12
InChI Key InChIKey=CHBIUSPBZNUKIW-UHFFFAOYSA-N
Data  2 IC50
  Tab Delimited (TSV)   2D SDfile   Computed 3D by Vconf -m prep SDfile
Find this compound or compounds like it in BindingDB:
Activity Spreadsheet -- Enzyme Inhibition Constant Data from BindingDB
Found 2 hits for monomerid = 245589
TargetProtein-tyrosine kinase 2-beta(Homo sapiens (Human))
Centaurus Biopharma
US Patent
LigandPNGBDBM245589(US9428508, 44)
Affinity DataIC50: <20nM. Assay description: To measure inhibitory activity of FAK/PYK2 inhibitors, compounds were first prepare as a 1 mM stock in 100% DMSO and 3-fold serial dilution was perfo...
Ligand InfoPC cidPC sid
In DepthDetails US Patent
TargetFocal adhesion kinase 1(Homo sapiens (Human))
Centaurus Biopharma
US Patent
LigandPNGBDBM245589(US9428508, 44)
Affinity DataIC50: <20nM. Assay description: To measure inhibitory activity of FAK/PYK2 inhibitors, compounds were first prepare as a 1 mM stock in 100% DMSO and 3-fold serial dilution was perfo...
Ligand InfoPC cidPC sid
In DepthDetails US Patent