BDBM245621 US9428508, 76
SMILES COc1cc(ccc1Nc1nc2NCCc2c(Nc2ccccc2S(=O)(=O)NC(C)C)n1)N1CCC(CC1)N(C)C
InChI Key InChIKey=IVNUQQAROVVTHP-UHFFFAOYSA-N
Data  2 IC50
  Tab Delimited (TSV)   2D SDfile   Computed 3D by Vconf -m prep SDfile
Find this compound or compounds like it in BindingDB:
Activity Spreadsheet -- Enzyme Inhibition Constant Data from BindingDB
Found 2 hits for monomerid = 245621
TargetProtein-tyrosine kinase 2-beta(Homo sapiens (Human))
Centaurus Biopharma
US Patent
LigandPNGBDBM245621(US9428508, 76)
Affinity DataIC50: <20nM. Assay description: To measure inhibitory activity of FAK/PYK2 inhibitors, compounds were first prepare as a 1 mM stock in 100% DMSO and 3-fold serial dilution was perfo...
Ligand InfoPC cidPC sid
In DepthDetails US Patent
TargetFocal adhesion kinase 1(Homo sapiens (Human))
Centaurus Biopharma
US Patent
LigandPNGBDBM245621(US9428508, 76)
Affinity DataIC50: <20nM. Assay description: To measure inhibitory activity of FAK/PYK2 inhibitors, compounds were first prepare as a 1 mM stock in 100% DMSO and 3-fold serial dilution was perfo...
Ligand InfoPC cidPC sid
In DepthDetails US Patent