BDBM247010 1-((1-(phenylsulfonyl)piperidin-4-yl)methyl)-5-(1H-pyrazol-4-yl)-1H-indole::US9701663, 5
SMILES O=S(=O)(N1CCC(Cn2ccc3cc(ccc23)-c2cn[nH]c2)CC1)c1ccccc1
InChI Key InChIKey=CYXUOQMXYUHKDE-UHFFFAOYSA-N
Data  3 IC50
  Tab Delimited (TSV)   2D SDfile   Computed 3D by Vconf -m prep SDfile
Find this compound or compounds like it in BindingDB:
Activity Spreadsheet -- Enzyme Inhibition Constant Data from BindingDB
Found 1 hit for monomerid = 247010
TargetInterleukin-17A(Homo sapiens (Human))
Innov17
US Patent
LigandPNGBDBM247010(1-((1-(phenylsulfonyl)piperidin-4-yl)methyl)-5-(1H...)
Affinity DataIC50: <1.00E+4nM. Assay description: Peripheral blood mononuclear cells (PBMCs) were sourced from freshly prepared leukocyte enriched plasma (buffy coat) from healthy donors (New York Bl...
Ligand InfoPC cidPC sid
In DepthDetails US Patent