BDBM247048 US9701669, 1
SMILES C[C@H]1OC(=O)[C@@]2(CC(F)(F)[C@@H](C)[C@H](\C=C\c3ccc(cn3)-c3ccccc3C#N)[C@H]12)C(N)=O
InChI Key InChIKey=NEKIZILDJUHYLI-TWOREGKPSA-N
Data  1 IC50
  Tab Delimited (TSV)   2D SDfile   Computed 3D by Vconf -m prep SDfile
Find this compound or compounds like it in BindingDB:
Activity Spreadsheet -- Enzyme Inhibition Constant Data from BindingDB
Found 1 hit for monomerid = 247048
TargetPotassium voltage-gated channel subfamily H member 2(Homo sapiens (Human))
Merck Sharp & Dohme
US Patent
LigandPNGBDBM247048(US9701669, 1)
Affinity DataIC50:  4.39E+4nMpH: 7.4 T: 2°C. Assay description: Drug cardiac arrhythmia is an important safety concern for pharmaceutical development and health regulatory authorities. Blockade of heterologously-e...
Ligand InfoPC cidPC sid
In DepthDetails US Patent