BDBM247185 US9434733, 2-[1-[(2-chloro-4-methoxy-phenyl)methyl]-4-methyl-pyrrolidin-3-yl]-7-tetrahydropyran-4-yl-3H-imidazo[5,1-f][1,2,4]triazin-4-one::US9533992, 2-[1-[(2-chloro-4-methoxy-phenyl)methyl]-4-methyl-pyrrolidin-3-yl]-7-tetrahydropyran-4-yl-3H-imidazo[5,1-f][1,2,4]triazin-4-one
SMILES COc1ccc(CN2CC(C)C(C2)c2nn3c(ncc3c(=O)[nH]2)C2CCOCC2)c(Cl)c1
InChI Key
Data  3 IC50
  Tab Delimited (TSV)   2D SDfile   Computed 3D by Vconf -m prep SDfile
Find this compound or compounds like it in BindingDB:
Activity Spreadsheet -- Enzyme Inhibition Constant Data from BindingDB
Found 3 hits for monomerid = 247185
TargetHigh affinity cGMP-specific 3',5'-cyclic phosphodiesterase 9A(Homo sapiens (Human))
H. Lundbeck
US Patent
LigandPNGBDBM247185(US9434733, 2-[1-[(2-chloro-4-methoxy-phenyl)methyl...)
Affinity DataIC50:  41nMT: 2°C. Assay description: A PDE9 assay may for example, be performed as follows: The assay is performed in 60 uL samples containing a fixed amount of the relevant PDE enzyme (...
Ligand InfoPC cidPC sid
In DepthDetails US Patent
TargetHigh affinity cGMP-specific 3',5'-cyclic phosphodiesterase 9A(Homo sapiens (Human))
H. Lundbeck
US Patent
LigandPNGBDBM247185(US9434733, 2-[1-[(2-chloro-4-methoxy-phenyl)methyl...)
Affinity DataIC50:  41nMpH: 7.6 T: 2°C. Assay description: A PDE9 assay may for example, be performed as follows: The assay is performed in 60 uL samples containing a fixed amount of the relevant PDE enzyme (...
Ligand InfoPC cidPC sid
In DepthDetails US Patent
TargetHigh affinity cGMP-specific 3',5'-cyclic phosphodiesterase 9A(Homo sapiens (Human))
H. Lundbeck
US Patent
LigandPNGBDBM247185(US9434733, 2-[1-[(2-chloro-4-methoxy-phenyl)methyl...)
Affinity DataIC50:  41nMpH: 7.6 T: 2°C. Assay description: A PDE9 assay may for example, be performed as follows: The assay is performed in 60 uL samples containing a fixed amount of the relevant PDE enzyme (...
Ligand InfoPC cidPC sid
In DepthDetails US Patent