BDBM247190 US9434733, 2-[[3-(4-fluorophenoxy)azetidin-1-yl]methyl]-7-tetrahydropyran-4-yl-3H-imidazo[5,1-f][1,2,4]triazin-4-one::US9533992, 2-[[3-(4-fluorophenoxy)azetidin-1-yl]methyl]-7-tetrahydropyran-4-yl-3H-imidazo[5,1-f][1,2,4]triazin-4-one
SMILES Fc1ccc(OC2CN(Cc3nn4c(ncc4c(=O)[nH]3)C3CCOCC3)C2)cc1
InChI Key InChIKey=KXXMSVLXMZUNBO-UHFFFAOYSA-N
Data  3 IC50
  Tab Delimited (TSV)   2D SDfile   Computed 3D by Vconf -m prep SDfile
Find this compound or compounds like it in BindingDB:
Activity Spreadsheet -- Enzyme Inhibition Constant Data from BindingDB
Found 3 hits for monomerid = 247190
TargetHigh affinity cGMP-specific 3',5'-cyclic phosphodiesterase 9A(Homo sapiens (Human))
H. Lundbeck
US Patent
LigandPNGBDBM247190(US9434733, 2-[[3-(4-fluorophenoxy)azetidin-1-yl]me...)
Affinity DataIC50:  80nMT: 2°C. Assay description: A PDE9 assay may for example, be performed as follows: The assay is performed in 60 uL samples containing a fixed amount of the relevant PDE enzyme (...
Ligand InfoPC cidPC sid
In DepthDetails US Patent
TargetHigh affinity cGMP-specific 3',5'-cyclic phosphodiesterase 9A(Homo sapiens (Human))
H. Lundbeck
US Patent
LigandPNGBDBM247190(US9434733, 2-[[3-(4-fluorophenoxy)azetidin-1-yl]me...)
Affinity DataIC50:  80nMpH: 7.6 T: 2°C. Assay description: A PDE9 assay may for example, be performed as follows: The assay is performed in 60 uL samples containing a fixed amount of the relevant PDE enzyme (...
Ligand InfoPC cidPC sid
In DepthDetails US Patent
TargetHigh affinity cGMP-specific 3',5'-cyclic phosphodiesterase 9A(Homo sapiens (Human))
H. Lundbeck
US Patent
LigandPNGBDBM247190(US9434733, 2-[[3-(4-fluorophenoxy)azetidin-1-yl]me...)
Affinity DataIC50:  80nMpH: 7.6 T: 2°C. Assay description: A PDE9 assay may for example, be performed as follows: The assay is performed in 60 uL samples containing a fixed amount of the relevant PDE enzyme (...
Ligand InfoPC cidPC sid
In DepthDetails US Patent