BDBM247245 US9434733, 7-tetrahydropyran-4-yl-2-[1-[3-[4-(trifluoromethoxy)phenyl]azetidin-1-yl]ethyl]-3H-imidazo[5,1-f][1,2,4]triazin-4-one::US9533992, 2-[1-[3-(4-methylphenoxy)azetidin-1-yl]ethyl]-7-tetrahydropyran-4-yl-3H-imidazo[5,1-f][1,2,4]triazin-4-one::US9533992, 7-tetrahydropyran-4-yl-2-[1-[3-[4-(trifluoromethoxy)phenyl]azetidin-1-yl]ethyl]-3H-imidazo[5,1-f][1,2,4]triazin-4-one
SMILES CC(N1CC(C1)c1ccc(OC(F)(F)F)cc1)c1nn2c(ncc2c(=O)[nH]1)C1CCOCC1
InChI Key
Data  4 IC50
  Tab Delimited (TSV)   2D SDfile   Computed 3D by Vconf -m prep SDfile
Find this compound or compounds like it in BindingDB:
Activity Spreadsheet -- Enzyme Inhibition Constant Data from BindingDB
Found 4 hits for monomerid = 247245
TargetHigh affinity cGMP-specific 3',5'-cyclic phosphodiesterase 9A(Homo sapiens (Human))
H. Lundbeck
US Patent
LigandPNGBDBM247245(US9434733, 7-tetrahydropyran-4-yl-2-[1-[3-[4-(trif...)
Affinity DataIC50:  210nMT: 2°C. Assay description: A PDE9 assay may for example, be performed as follows: The assay is performed in 60 uL samples containing a fixed amount of the relevant PDE enzyme (...
Ligand InfoPC cidPC sid
In DepthDetails US Patent
TargetHigh affinity cGMP-specific 3',5'-cyclic phosphodiesterase 9A(Homo sapiens (Human))
H. Lundbeck
US Patent
LigandPNGBDBM247245(US9434733, 7-tetrahydropyran-4-yl-2-[1-[3-[4-(trif...)
Affinity DataIC50:  110nMpH: 7.6 T: 2°C. Assay description: A PDE9 assay may for example, be performed as follows: The assay is performed in 60 uL samples containing a fixed amount of the relevant PDE enzyme (...
Ligand InfoPC cidPC sid
In DepthDetails US Patent
TargetHigh affinity cGMP-specific 3',5'-cyclic phosphodiesterase 9A(Homo sapiens (Human))
H. Lundbeck
US Patent
LigandPNGBDBM247245(US9434733, 7-tetrahydropyran-4-yl-2-[1-[3-[4-(trif...)
Affinity DataIC50:  210nMpH: 7.6 T: 2°C. Assay description: A PDE9 assay may for example, be performed as follows: The assay is performed in 60 uL samples containing a fixed amount of the relevant PDE enzyme (...
Ligand InfoPC cidPC sid
In DepthDetails US Patent
TargetHigh affinity cGMP-specific 3',5'-cyclic phosphodiesterase 9A(Homo sapiens (Human))
H. Lundbeck
US Patent
LigandPNGBDBM247245(US9434733, 7-tetrahydropyran-4-yl-2-[1-[3-[4-(trif...)
Affinity DataIC50:  210nMpH: 7.6 T: 2°C. Assay description: A PDE9 assay may for example, be performed as follows: The assay is performed in 60 uL samples containing a fixed amount of the relevant PDE enzyme (...
Ligand InfoPC cidPC sid
In DepthDetails US Patent