BDBM247448 US9453023, 7
SMILES CC1CCCN1C1CC[C@@H](C1)c1ccc(cc1)N1CCCC2(CCCC2)C1=O
InChI Key InChIKey=WTELTKRDPRFOTM-SWCONJRYSA-N
Data  1 KI
  Tab Delimited (TSV)   2D SDfile   Computed 3D by Vconf -m prep SDfile
Find this compound or compounds like it in BindingDB:
Activity Spreadsheet -- Enzyme Inhibition Constant Data from BindingDB
Found 1 hit for monomerid = 247448
TargetHistamine receptor H3(Macaca mulatta (Rhesus macaque))
Sanofi
US Patent
LigandPNGBDBM247448(US9453023, 7)
Affinity DataKi:  27.5nM. Assay description: Rhesus H3 radioligand binding assay was performed using rhesus H3 receptor membranes (prepared as described above), [3H]-Methylhistamine (Perkin Elme...
Ligand InfoPC cidPC sid
In DepthDetails US Patent