BDBM248426 US9434711, 292
SMILES OC(=O)c1ccc(cc1)S(=O)(=O)N(Cc1ccc(F)c(c1)C(F)(F)F)c1sc2ccccc2c1Br
InChI Key InChIKey=WSUWGLCXTUHHIK-UHFFFAOYSA-N
Data  1 IC50
  Tab Delimited (TSV)   2D SDfile   Computed 3D by Vconf -m prep SDfile
Find this compound or compounds like it in BindingDB:
Activity Spreadsheet -- Enzyme Inhibition Constant Data from BindingDB
Found 1 hit for monomerid = 248426
TargetTransient receptor potential M8 protein(Canis lupus familiaris (Dog))
Janssen Pharmaceutica
US Patent
LigandPNGBDBM248426(US9434711, 292)
Affinity DataIC50:  0.800nMT: 2°C. Assay description: The functional activity of compounds of the formula (I) was determined by measuring changes in intracellular calcium concentration using a Ca2+-sensi...
Ligand InfoPC cidPC sid
In DepthDetails US Patent