BDBM249148 US9453038, 26
SMILES COC(=O)CCc1ccc(Oc2cc3cc([nH]c3cc2C2CCC(=O)N2C)-c2ccccn2)cc1
InChI Key
Data  1 EC50
  Tab Delimited (TSV)   2D SDfile   Computed 3D by Vconf -m prep SDfile
Find this compound or compounds like it in BindingDB:
Activity Spreadsheet -- Enzyme Inhibition Constant Data from BindingDB
Found 1 hit for monomerid = 249148
TargetHexokinase-4(Homo sapiens (Human))
Merck Sharp & Dohme
US Patent
LigandPNGBDBM249148(US9453038, 26)
Affinity DataEC50:  4.30nMT: 2°C. Assay description: To test the exemplified compounds, the following assay was employed. Recombinant human liver glucokinase was expressed as a FLAG fusion protein in E....
Ligand InfoPC cidPC sid
In DepthDetails US Patent